This is the mail archive of the cygwin mailing list for the Cygwin project.

Index Nav: [Date Index] [Subject Index] [Author Index] [Thread Index]
Message Nav: [Date Prev] [Date Next] [Thread Prev] [Thread Next]
Other format: [Raw text]

can not compile cscope on cygwin

I am using latest version cygwin and I just downloaded cscope 15.5, but in compiling it there is such error,

$ make
make all-recursive
make[1]: Entering directory `/c/bin/cscope-15.5'
Making all in doc
make[2]: Entering directory `/c/bin/cscope-15.5/doc'
make[2]: Nothing to be done for `all'.
make[2]: Leaving directory `/c/bin/cscope-15.5/doc'
Making all in src
make[2]: Entering directory `/c/bin/cscope-15.5/src'
/bin/bash ../ylwrap `test -f 'fscanner.l' || echo './'`fscanner.l .c fscanner.c -- :
make[2]: *** [fscanner.c] Error 1
make[2]: Leaving directory `/c/bin/cscope-15.5/src'
make[1]: *** [all-recursive] Error 1
make[1]: Leaving directory `/c/bin/cscope-15.5'
make: *** [all] Error 2

Do you know what is wrong?

Is there any pre-compiled cscope for cygwin somewhere?


Don?t just search. Find. Check out the new MSN Search!

-- Unsubscribe info: Problem reports: Documentation: FAQ:

Index Nav: [Date Index] [Subject Index] [Author Index] [Thread Index]
Message Nav: [Date Prev] [Date Next] [Thread Prev] [Thread Next]