This is the mail archive of the gdb-testers@sourceware.org mailing list for the GDB project.


Index Nav: [Date Index] [Subject Index] [Author Index] [Thread Index]
Message Nav: [Date Prev] [Date Next] [Thread Prev] [Thread Next]
Other format: [Raw text]

GNU gdb (GDB) 7.5.50.20121211-cvs s390-ibm-linux-gnu CVS timestamp: 2012-12-11 06:04 UTC


Test Run By dailybuilt on Tue Dec 11 07:09:45 2012
Native configuration is s390-ibm-linux-gnu

		=== gdb tests ===

Schedule of variations:
    unix

FAIL: gdb.ada/array_return.exp: value printed by finish of Create_Small
FAIL: gdb.ada/array_return.exp: value printed by finish of Create_Large
FAIL: gdb.ada/array_return.exp: value printed by finish of Create_Small_Float_Vector
FAIL: gdb.ada/mi_task_arg.exp: -stack-list-arguments 1
FAIL: gdb.ada/operator_bp.exp: break "+"
FAIL: gdb.ada/operator_bp.exp: break "-"
FAIL: gdb.ada/operator_bp.exp: break "mod"
FAIL: gdb.base/call-sc.exp: value foo returned; return call-sc-tld
FAIL: gdb.base/dfp-test.exp: Correct _Decimal128 return value from called function.
FAIL: gdb.base/funcargs.exp: continue to callc1b
FAIL: gdb.base/funcargs.exp: continue to callc2b
gdb compile failed, /usr/local/bin/ld: BFD (Linux/GNU Binutils) 2.22.52.0.4.20120604 internal error, aborting at elf32-s390.c line 3309 in elf_s390_finish_dynamic_symbol
/usr/local/bin/ld: Please report this bug.
collect2: error: ld returned 1 exit status
FAIL: gdb.base/longjmp.exp: next over longjmp(1)
FAIL: gdb.base/longjmp.exp: next over call_longjmp (2)
gdb compile failed, cc1: error: '-fsplit-stack' is not supported by this compiler configuration
FAIL: gdb.base/skip.exp: step after disabling 3 (1)
FAIL: gdb.base/skip.exp: step after disabling 3 (3)
gdb compile failed, /gdb/testsuite/gdb.base/stap-probe.c:43:2: error: #error "not using SystemTap v3 probes"
 #error "not using SystemTap v3 probes"
  ^
FAIL: gdb.cp/abstract-origin.exp: p problem
FAIL: gdb.cp/converts.exp: continue to breakpoint: end of main
FAIL: gdb.cp/converts.exp: p foo1_7(*a)
FAIL: gdb.cp/temargs.exp: test type of T in inner_m
FAIL: gdb.cp/temargs.exp: test value of I in inner_m
FAIL: gdb.cp/temargs.exp: test value of P in inner_m
FAIL: gdb.cp/temargs.exp: test value of MP in inner_m
FAIL: gdb.fortran/array-element.exp: continue to breakpoint once again (the program exited)
FAIL: gdb.fortran/array-element.exp: print the second element of array a
gdb compile failed, default_target_compile: Can't find gccgo.
gdb compile failed, default_target_compile: Can't find gccgo.
gdb compile failed, default_target_compile: Can't find gccgo.
gdb compile failed, default_target_compile: Can't find gccgo.
gdb compile failed, default_target_compile: Can't find gccgo.
gdb compile failed, default_target_compile: Can't find gccgo.
gdb compile failed, default_target_compile: Can't find gccgo.
gdb compile failed, default_target_compile: Can't find gccgo.
gdb compile failed, default_target_compile: Can't find gccgo.
FAIL: gdb.mi/mi-breakpoint-changed.exp: mi runto main (unknown output after running)
FAIL: gdb.mi/mi-breakpoint-changed.exp: catch syscall
FAIL: gdb.mi/mi-breakpoint-changed.exp: dprintf marker, "arg" "
FAIL: gdb.mi/mi-breakpoint-changed.exp: delete 6
FAIL: gdb.mi/mi-breakpoint-changed.exp: pending resolved: breakpoint on pendfunc1 resolved
FAIL: gdb.mi/mi-breakpoint-changed.exp: pending resolved: continue to pendfunc1 breakpoint (timeout)
FAIL: gdb.mi/mi-breakpoint-changed.exp: pending resolved: continue to marker 1 (MI error)
FAIL: gdb.mi/mi-breakpoint-changed.exp: pending resolved: continue to marker 1 (timeout)
FAIL: gdb.mi/mi-breakpoint-changed.exp: pending resolved: continuing execution to marker (MI error)
FAIL: gdb.mi/mi-breakpoint-changed.exp: pending resolved: breakpoint on pendfunc3 resolved (timeout)
FAIL: gdb.mi/mi-breakpoint-changed.exp: pending resolved: continue to marker 2 (timeout)
FAIL: gdb.mi/mi-breakpoint-changed.exp: pending resolved: continuing to exit (MI error)
FAIL: gdb.mi/mi-breakpoint-changed.exp: pending resolved: breakpoint on pendfunc3 pending again (timeout)
FAIL: gdb.mi/mi-breakpoint-changed.exp: pending resolved: (unknown output after running)
FAIL: gdb.mi/mi-var-create-rtti.exp: -var-create sp1 * $sp
FAIL: gdb.mi/mi-watch-nonstop.exp: delete watchpoint
FAIL: gdb.mi/pr11022.exp: data-write-memory-bytes &x "01": watchpoint hit 2 (unknown output after running)
FAIL: gdb.modula2/unbounded-array.exp: print unbounded array contents
gdb compile failed, In file included from /usr/include/features.h:387:0,
                 from /usr/include/stdio.h:28,
                 from /gdb/testsuite/gdb.multi/multi-arch-exec.c:18:
/usr/include/gnu/stubs.h:9:27: fatal error: gnu/stubs-64.h: No such file or directory
 # include <gnu/stubs-64.h>
                           ^
compilation terminated.
gdb compile failed, /usr/local/bin/ld: skipping incompatible /usr/lib/libm.so when searching for -lm
/usr/local/bin/ld: skipping incompatible /usr/lib/libm.a when searching for -lm
/usr/local/bin/ld: cannot find -lm
/usr/local/bin/ld: skipping incompatible /build/build-system/build/20121210/gcc-head/install-s390-esa/lib/gcc/s390-ibm-linux-gnu/4.8.0/libgcc.a when searching for -lgcc
/usr/local/bin/ld: cannot find -lgcc
/usr/local/bin/ld: skipping incompatible /build/build-system/build/20121210/gcc-head/install-s390-esa/lib/libgcc_s.so when searching for -lgcc_s
/usr/local/bin/ld: skipping incompatible /build/build-system/build/20121210/gcc-head/install-s390-esa/lib/gcc/s390-ibm-linux-gnu/4.8.0/../../../libgcc_s.so when searching for -lgcc_s
/usr/local/bin/ld: skipping incompatible /usr/local/lib/libgcc_s.so when searching for -lgcc_s
/usr/local/bin/ld: cannot find -lgcc_s
/usr/local/bin/ld: skipping incompatible /usr/lib/libc.so when searching for -lc
/usr/local/bin/ld: skipping incompatible /usr/lib/libc.a when searching for -lc
/usr/local/bin/ld: cannot find -lc
/usr/local/bin/ld: skipping incompatible /build/build-system/build/20121210/gcc-head/install-s390-esa/lib/gcc/s390-ibm-linux-gnu/4.8.0/libgcc.a when searching for -lgcc
/usr/local/bin/ld: cannot find -lgcc
/usr/local/bin/ld: skipping incompatible /build/build-system/build/20121210/gcc-head/install-s390-esa/lib/libgcc_s.so when searching for -lgcc_s
/usr/local/bin/ld: skipping incompatible /build/build-system/build/20121210/gcc-head/install-s390-esa/lib/gcc/s390-ibm-linux-gnu/4.8.0/../../../libgcc_s.so when searching for -lgcc_s
/usr/local/bin/ld: skipping incompatible /usr/local/lib/libgcc_s.so when searching for -lgcc_s
/usr/local/bin/ld: cannot find -lgcc_s
collect2: error: ld returned 1 exit status
FAIL: gdb.opt/inline-cmds.exp: step into finish marker
FAIL: gdb.opt/inline-cmds.exp: enter inlined_fn from noinline
FAIL: gdb.opt/inline-cmds.exp: backtrace at inlined_fn from noinline
FAIL: gdb.opt/inline-cmds.exp: inlined_fn from noinline inlined
FAIL: gdb.opt/inline-cmds.exp: up to noinline
FAIL: gdb.opt/inline-cmds.exp: noinline from outer_inline1 not inlined
FAIL: gdb.opt/inline-cmds.exp: outer_inline2 inlined
FAIL: gdb.opt/inline-cmds.exp: up from outer_inline2
FAIL: gdb.stabs/gdb11479.exp: Inspect t in test2 forced_stabs
FAIL: gdb.stabs/gdb11479.exp: Inspect t in test forced_stabs
FAIL: gdb.trace/change-loc.exp: Can't run to main to check for trace support
FAIL: gdb.trace/mi-traceframe-changed.exp: tfile: tfind 0
FAIL: gdb.trace/mi-traceframe-changed.exp: tfile: tfind 0 again
FAIL: gdb.trace/mi-tracepoint-changed.exp: Can't run to main to check for trace support
FAIL: gdb.trace/pending.exp: Can't run to main to check for trace support
FAIL: gdb.trace/tfile.exp: tfind 0 on trace file
gdb compile failed, gcc: error: /gdb/testsuite/../gdbserver/libinproctrace.so: No such file or directory

		=== gdb Summary ===

# of expected passes		21688
# of unexpected failures	58
# of unexpected successes	2
# of expected failures		33
# of known failures		58
# of untested testcases		31
# of unsupported tests		33
/gdb/testsuite/../../gdb/gdb version  7.5.50.20121211-cvs -nw -nx -data-directory /gdb/testsuite/../data-directory 

PATH=/build/build-system/build/20121210/gcc-head/install-s390-esa/bin:/usr/lib/qt-3.3/bin:/usr/kerberos/sbin:/usr/kerberos/bin:/usr/local/bin:/bin:/usr/bin:/usr/local/sbin:/usr/sbin:/sbin:/home/dailybuilt/bin

GCC Version

Using built-in specs.
COLLECT_GCC=gcc
COLLECT_LTO_WRAPPER=/build/build-system/build/20121210/gcc-head/install-s390-esa/libexec/gcc/s390-ibm-linux-gnu/4.8.0/lto-wrapper
Target: s390-ibm-linux-gnu
Configured with: /build/build-system/build/20121210/gcc-head/src/configure --prefix=/build/build-system/build/20121210/gcc-head/install-s390-esa --enable-shared --with-system-zlib --enable-threads=posix --enable-__cxa_atexit --enable-checking --enable-languages=c,c++,objc,obj-c++,java,fortran,ada
Thread model: posix
gcc version 4.8.0 20121210 (experimental) (GCC) 


Index Nav: [Date Index] [Subject Index] [Author Index] [Thread Index]
Message Nav: [Date Prev] [Date Next] [Thread Prev] [Thread Next]