This is the mail archive of the mailing list for the Cygwin project.

Index Nav: [Date Index] [Subject Index] [Author Index] [Thread Index]
Message Nav: [Date Prev] [Date Next] [Thread Prev] [Thread Next]

GCC *builds* now... but no install

Okay, so I found the problems I was having getting GCC built - the Cygnus
installer seems to be a bit confused (I mirrored the installation, and when
I ran the installer it installed lots of different versions of things, and
it can't install bzip'ed files.)

Anyway, so I got that cleared up.  Now GCC 3.0 compiles just fine, but when
I do a "make install" I get the following:

   make[1]: Leaving directory `/home/MCOGoSchum/gccobj/gcc'
   make[1]: Entering directory `/home/MCOGoSchum/gccobj/fastjar'
   make[2]: Entering directory `/home/MCOGoSchum/gccobj/fastjar'
   /bin/sh ../../gcc-3.0/fastjar/mkinstalldirs /usr/local/bin
     /bin/sh /home/MCOGoSchum/gcc-3.0/install-sh -c  jar /usr/local/bin/jar
   cp: `jar' and `/usr/local/bin/#inst.912#' are the same file
   make[2]: *** [install-binPROGRAMS] Error 1
   make[2]: Leaving directory `/home/MCOGoSchum/gccobj/fastjar'
   make[1]: *** [install-am] Error 2
   make[1]: Leaving directory `/home/MCOGoSchum/gccobj/fastjar'
   make: *** [install-fastjar] Error 2

This happens whether I do a straight "configure" or "configure
--prefix=/usr" to match GCC's current install location.

Any ideas on this one?

Unsubscribe info:
Bug reporting:

Index Nav: [Date Index] [Subject Index] [Author Index] [Thread Index]
Message Nav: [Date Prev] [Date Next] [Thread Prev] [Thread Next]