Error 1 and error 2 compiling winsup

Brian Keener
Thu Nov 16 17:28:00 GMT 2000

I updated my src using cvs to get the updated cinstall and went ahead and 
got all of winsup as well on the night of Nov 13.  I tried simply doing a 
make and got the following error 1 and error 2.  I removed everything in 
my /build directory and reran configure and still got the following same 

Anyone have a clue why this is happening or what might be wrong.

/src/winsup/cygwin/ In function `long int sysconf(int)':
/src/winsup/cygwin/ `_SC_NPROCESSORS_CONF' undeclared 
(first use t
his function)
/src/winsup/cygwin/ (Each undeclared identifier is reported 
only o
/src/winsup/cygwin/ for each function it appears in.)
/src/winsup/cygwin/ `_SC_NPROCESSORS_ONLN' undeclared 
(first use t
his function)
/src/winsup/cygwin/ `_SC_PHYS_PAGES' undeclared (first use 
this fu
/src/winsup/cygwin/ `_SC_AVPHYS_PAGES' undeclared (first 
use this
/src/winsup/cygwin/ warning: unreachable code at beginning 
of swit
ch statement
gcc: file path prefix `/build/i586-pc-cygwin/newlib/' never used
make[2]: *** [sysconf.o] Error 1
make[2]: Leaving directory `/build/i586-pc-cygwin/winsup/cygwin'
make[1]: *** [cygwin] Error 2
make[1]: Leaving directory `/build/i586-pc-cygwin/winsup'
make: *** [all-target-winsup] Error 2

More information about the Cygwin-developers mailing list